Target
Tyrosine-protein kinase BTK
Ligand
BDBM390073
Substrate
Meas. Tech.
Btk Kinase Assay
IC50
50050±n/a nM
Citation
 Liu, DZhang, MHu, Q Aminopyridazinone compounds as protein kinase inhibitors US Patent  US10323037 Publication Date 6/18/2019 
Target
Name:
Tyrosine-protein kinase BTK
Synonyms:
AGMX1 Agammaglobulinaemia tyrosine kinase B cell progenitor kinase BPK BTK_HUMAN Tyrosine Kinase BTK Tyrosine-protein kinase BTK (BTK)
Type:
Enzyme
Mol. Mass.:
76289.95
Organism:
Homo sapiens (Human)
Description:
Q06187
Residue:
659
  
Inhibitor
Name:
BDBM390073
Synonyms:
US10323037, Example 86 | US9951077, 86
Type:
Small organic molecule
Emp. Form.:
C24H20ClFN6O2
Mol. Mass.:
478.906
SMILES:
Nc1n[nH]c(=O)c2n([C@@H]3CCCN(C3)C#N)c(Cl)c(-c3ccc(Oc4ccccc4F)cc3)c12
: