Target
Tyrosine-protein kinase BTK
Ligand
BDBM390089
Substrate
Meas. Tech.
Btk Kinase Assay
IC50
50050±n/a nM
Citation
 Liu, DZhang, MHu, Q Aminopyridazinone compounds as protein kinase inhibitors US Patent  US10323037 Publication Date 6/18/2019 
Target
Name:
Tyrosine-protein kinase BTK
Synonyms:
AGMX1 Agammaglobulinaemia tyrosine kinase B cell progenitor kinase BPK BTK_HUMAN Tyrosine Kinase BTK Tyrosine-protein kinase BTK (BTK)
Type:
Enzyme
Mol. Mass.:
76289.95
Organism:
Homo sapiens (Human)
Description:
Q06187
Residue:
659
  
Inhibitor
Name:
BDBM390089
Synonyms:
US10323037, Example 101 | US9951077, 101
Type:
Small organic molecule
Emp. Form.:
C26H22FN5O3
Mol. Mass.:
471.483
SMILES:
CC#CC(=O)N1CC[C@@H](C1)n1cc(-c2ccc(Oc3ccccc3F)cc2)c2c(N)n[nH]c(=O)c12
: