Target
Tyrosine-protein kinase BTK
Ligand
BDBM416824
Substrate
Meas. Tech.
Btk Kinase Assay
IC50
<10±n/a nM
Citation
 Liu, DZhang, MHu, Q Aminopyridazinone compounds as protein kinase inhibitors US Patent  US10323037 Publication Date 6/18/2019 
Target
Name:
Tyrosine-protein kinase BTK
Synonyms:
AGMX1 Agammaglobulinaemia tyrosine kinase B cell progenitor kinase BPK BTK_HUMAN Tyrosine Kinase BTK Tyrosine-protein kinase BTK (BTK)
Type:
Enzyme
Mol. Mass.:
76289.95
Organism:
Homo sapiens (Human)
Description:
Q06187
Residue:
659
  
Inhibitor
Name:
BDBM416824
Synonyms:
(R)-4-amino-1-(1-(but-2-ynoyl)pyrrolidin-3-yl)-3-(4-phenoxyphenyl)-1H-pyrazolo[3,4-d]pyridazin-7(6H)-one | US10323037, Example 111
Type:
Small organic molecule
Emp. Form.:
C25H22N6O3
Mol. Mass.:
454.4806
SMILES:
CC#CC(=O)N1CCC(C1)n1nc(-c2ccc(Oc3ccccc3)cc2)c2c(N)n[nH]c(=O)c12
: