Target
Plasma kallikrein
Ligand
BDBM416780
Substrate
Meas. Tech.
Plasma Kallikrein Activity Assay
Ki
25.1±n/a nM
Citation
 Kotian, PLBabu, YSWu, MChintareddy, VRKumar, VSZhang, W Human plasma kallikrein inhibitors US Patent  US10329260 Publication Date 6/25/2019 
Target
Name:
Plasma kallikrein
Synonyms:
Fletcher factor KLKB1 Kallikrein Plasma kallikrein heavy chain Plasma prekallikrein
Type:
Protein
Mol. Mass.:
71391.16
Organism:
Homo sapiens (Human)
Description:
P03952
Residue:
638
  
Inhibitor
Name:
BDBM416780
Synonyms:
1-(3-(aminomethyl)phenyl)-N-(3-((cyclopropylmethylamino)(thiazol-2-yl)methyl)phenyl)-3-(trifluoromethyl)-1H-pyrazole-5-carboxamide US10633345, Compound 85c US11203574, Compound 85c US11685721, Compound 85c | US11708332, Compound 85c
Type:
Small organic molecule
Emp. Form.:
C26H25F3N6OS
Mol. Mass.:
526.577
SMILES:
NCc1cccc(c1)-n1nc(cc1C(=O)Nc1cccc(c1)C(NCC1CC1)c1nccs1)C(F)(F)F
: