Target
Plasma kallikrein
Ligand
BDBM417032
Substrate
Meas. Tech.
Plasma Kallikrein Activity Assay
Ki
25.1±n/a nM
Citation
 Kotian, PLBabu, YSWu, MChintareddy, VRKumar, VSZhang, W Human plasma kallikrein inhibitors US Patent  US10329260 Publication Date 6/25/2019 
Target
Name:
Plasma kallikrein
Synonyms:
Fletcher factor KLKB1 Kallikrein Plasma kallikrein heavy chain Plasma prekallikrein
Type:
Protein
Mol. Mass.:
71391.16
Organism:
Homo sapiens (Human)
Description:
P03952
Residue:
638
  
Inhibitor
Name:
BDBM417032
Synonyms:
1-(1-aminoisoquinolin-7-yl)-N-(5-(3-cyclopropyl-1-(2,4-dioxo-3,4-dihydropyrimidin-1(2H)-yl)propyl)-2-fluorophenyl)-3-(trifluoromethyl)-1H-pyrazole-5-carboxamide US10633345, Compound 269b US11203574, Compound 269b US11685721, Compound 269b | US11708332, Compound 269b
Type:
Small organic molecule
Emp. Form.:
C30H25F4N7O3
Mol. Mass.:
607.5582
SMILES:
Nc1nccc2ccc(cc12)-n1nc(cc1C(=O)Nc1cc(ccc1F)C(CCC1CC1)n1ccc(=O)[nH]c1=O)C(F)(F)F
: