Target
Metabotropic glutamate receptor 2
Ligand
BDBM417051
Substrate
Meas. Tech.
mGlu2 Ca2+ Flux Assay
IC50
>30000±n/a nM
Citation
 Conn, PJLindsley, CWEmmitte, KAEngers, JLBollinger, KABreiner, MM Negative allosteric modulators of metabotropic glutamate receptor 3 US Patent  US10399948 Publication Date 9/3/2019 
Target
Name:
Metabotropic glutamate receptor 2
Synonyms:
GRM2_RAT Grm2 | Mglur2
Type:
PROTEIN
Mol. Mass.:
95786.41
Organism:
Rattus norvegicus
Description:
ChEMBL_105034
Residue:
872
  
Inhibitor
Name:
BDBM417051
Synonyms:
1-(4-fluorophenyl)-4-(2-(phenylthio)ethoxy)pyridin-2(1H)-one | US10399948, Compound 3
Type:
Small organic molecule
Emp. Form.:
C19H16FNO2S
Mol. Mass.:
341.399
SMILES:
Fc1ccc(cc1)-n1ccc(OCCSc2ccccc2)cc1=O
: