Target
Metabotropic glutamate receptor 3
Ligand
BDBM50278654
Substrate
Meas. Tech.
mGlu3 Ca2+ Flux Assay
IC50
219±n/a nM
Citation
 Conn, PJLindsley, CWEmmitte, KAEngers, JLBollinger, KABreiner, MM Negative allosteric modulators of metabotropic glutamate receptor 3 US Patent  US10399948 Publication Date 9/3/2019 
Target
Name:
Metabotropic glutamate receptor 3
Synonyms:
GRM3_RAT Grm3 glutamate receptor, metabotropic 3 precursor
Type:
Protein
Mol. Mass.:
98971.84
Organism:
Rattus norvegicus (Rat)
Description:
P31422
Residue:
879
  
Inhibitor
Name:
BDBM50278654
Synonyms:
CHEMBL4174544 | US10399948, Compound 15
Type:
Small organic molecule
Emp. Form.:
C18H14F2N2O3
Mol. Mass.:
344.3122
SMILES:
Fc1ccc(cc1F)-n1ccc(OCCOc2ccccc2)nc1=O
: