Target
Metabotropic glutamate receptor 3
Ligand
BDBM417086
Substrate
Meas. Tech.
mGlu3 Ca2+ Flux Assay
IC50
1840±n/a nM
Citation
 Conn, PJLindsley, CWEmmitte, KAEngers, JLBollinger, KABreiner, MM Negative allosteric modulators of metabotropic glutamate receptor 3 US Patent  US10399948 Publication Date 9/3/2019 
Target
Name:
Metabotropic glutamate receptor 3
Synonyms:
GRM3_RAT Grm3 glutamate receptor, metabotropic 3 precursor
Type:
Protein
Mol. Mass.:
98971.84
Organism:
Rattus norvegicus (Rat)
Description:
P31422
Residue:
879
  
Inhibitor
Name:
BDBM417086
Synonyms:
4-(2-(2-chlorophenoxy)ethoxy)-1-(4-fluorophenyl)pyridin-2(1H)-one | US10399948, Compound 37
Type:
Small organic molecule
Emp. Form.:
C19H15ClFNO3
Mol. Mass.:
359.779
SMILES:
Fc1ccc(cc1)-n1ccc(OCCOc2ccccc2Cl)cc1=O
: