Target
Metabotropic glutamate receptor 3
Ligand
BDBM417101
Substrate
Meas. Tech.
mGlu3 Ca2+ Flux Assay
IC50
1940±n/a nM
Citation
 Conn, PJLindsley, CWEmmitte, KAEngers, JLBollinger, KABreiner, MM Negative allosteric modulators of metabotropic glutamate receptor 3 US Patent  US10399948 Publication Date 9/3/2019 
Target
Name:
Metabotropic glutamate receptor 3
Synonyms:
GRM3_RAT Grm3 glutamate receptor, metabotropic 3 precursor
Type:
Protein
Mol. Mass.:
98971.84
Organism:
Rattus norvegicus (Rat)
Description:
P31422
Residue:
879
  
Inhibitor
Name:
BDBM417101
Synonyms:
1-(4-fluorophenyl)-4-(2-(pyridin-2-yloxy)ethoxy)pyridin-2(1H)-one | US10399948, Compound 50
Type:
Small organic molecule
Emp. Form.:
C18H15FN2O3
Mol. Mass.:
326.3217
SMILES:
Fc1ccc(cc1)-n1ccc(OCCOc2ccccn2)cc1=O
: