Target
Metabotropic glutamate receptor 2
Ligand
BDBM417107
Substrate
Meas. Tech.
mGlu2 Ca2+ Flux Assay
IC50
>30000±n/a nM
Citation
 Conn, PJLindsley, CWEmmitte, KAEngers, JLBollinger, KABreiner, MM Negative allosteric modulators of metabotropic glutamate receptor 3 US Patent  US10399948 Publication Date 9/3/2019 
Target
Name:
Metabotropic glutamate receptor 2
Synonyms:
GRM2_RAT Grm2 | Mglur2
Type:
PROTEIN
Mol. Mass.:
95786.41
Organism:
Rattus norvegicus
Description:
ChEMBL_105034
Residue:
872
  
Inhibitor
Name:
BDBM417107
Synonyms:
4-(2-((6-chloropyridin-2-yl)oxy)ethoxy)-1-(4-fluorophenyl)pyridin-2(1H)-one | US10399948, Compound 53
Type:
Small organic molecule
Emp. Form.:
C18H14ClFN2O3
Mol. Mass.:
360.767
SMILES:
Fc1ccc(cc1)-n1ccc(OCCOc2cccc(Cl)n2)cc1=O
: