Target
Phosphatidylinositol 3-kinase regulatory subunit beta
Ligand
BDBM295666
Substrate
Meas. Tech.
p110alpha (Alpha) PI3K Binding Assay
Ki
>1000±n/a nM
Citation
 Braun, MHanan, EStaben, STHeald, RAMacLeod, CElliott, R Benzoxazepin oxazolidinone compounds and methods of use US Patent  US10112932 Publication Date 10/30/2018 
Target
Name:
Phosphatidylinositol 3-kinase regulatory subunit beta
Synonyms:
P85B_HUMAN PI3-kinase subunit p85-beta PIK3R2 PtdIns-3-kinase regulatory subunit beta | PtdIns-3-kinase regulatory subunit p85-beta
Type:
Enzyme Subunit
Mol. Mass.:
81542.75
Organism:
Homo sapiens (Human)
Description:
O00459
Residue:
728
  
Inhibitor
Name:
BDBM295666
Synonyms:
(S)-2-cyclobutyl-2-((2-((R)-4- methyl-2-oxooxazolidin-3-yl)-5,6- dihydrobenzo[f]imidazo[1,2- d][1,4]oxazepin-9- yl)amino)acetamide US10851091, Compound 102
Type:
Small organic molecule
Emp. Form.:
C21H25N5O4
Mol. Mass.:
411.4543
SMILES:
C[C@@H]1COC(=O)N1c1cn2CCOc3cc(N[C@@H](C4CCC4)C(N)=O)ccc3-c2n1
: