Target
Neuronal acetylcholine receptor subunit alpha-7
Ligand
BDBM397139
Substrate
Meas. Tech.
Measurement of Human α7 Nicotinic Acetylcholine Receptor (nAChR)'s Activity
EC50
>1000±n/a nM
Citation
 Maeng, CYJang, YKCha, SBShin, HWJoung, CMYi, EJ Pharmaceutical composition comprising pyridone derivatives US Patent  US10456385 Publication Date 10/29/2019 
Target
Name:
Neuronal acetylcholine receptor subunit alpha-7
Synonyms:
ACHA7_HUMAN Cholinergic, Nicotinic Alpha7 Neuronal acetylcholine receptor protein alpha-7 subunit Nicotinic acetylcholine receptor alpha-7 (alpha7 nAChR)
Type:
Mol. Mass.:
56448.33
Organism:
Homo sapiens (Human)
Description:
CHRNA7 (NACHRA7)
Residue:
502
  
Inhibitor
Name:
BDBM397139
Synonyms:
N-(1-azabicyclo[2.2.2]octan-3-yl)-1-[5-methyl-1,3,4-thiadiazole-2-yl)-6-oxo-3-pyridinecarboxamide US9987259, Example 42
Type:
Small organic molecule
Emp. Form.:
C16H19N5O2S
Mol. Mass.:
345.419
SMILES:
Cc1nnc(s1)-n1cc(ccc1=O)C(=O)NC1CN2CCC1CC2
: