Target
Histone deacetylase 6
Ligand
BDBM417063
Substrate
Meas. Tech.
HDAC Enzyme Activity Inhibition Assay (In Vitro)
IC50
14.6±n/a nM
Citation
 Kozikowski, AShen, SBergman, JGaisina, I Tetrahydroquinoline substituted hydroxamic acids as selective histone deacetylase 6 inhibitors US Patent  US10456394 Publication Date 10/29/2019 
Target
Name:
Histone deacetylase 6
Synonyms:
Cereblon/Histone deacetylase 6 HDAC6 Histone deacetylase 6 (HDAC6) KIAA0901 | ORF Names:JM21
Type:
Chromatin regulator; hydrolase; repressor
Mol. Mass.:
131381.51
Organism:
Homo sapiens (Human)
Description:
Q9UBN7
Residue:
1215
  
Inhibitor
Name:
BDBM417063
Synonyms:
4-((3,4-dihydroquinolin-1(2H)-yl)methyl)-N-hydroxybenzamide | US10456394, Example 1
Type:
Small organic molecule
Emp. Form.:
C17H18N2O2
Mol. Mass.:
282.337
SMILES:
ONC(=O)c1ccc(CN2CCCc3ccccc23)cc1
: