Target
Histone deacetylase 1
Ligand
BDBM417068
Substrate
Meas. Tech.
HDAC Enzyme Activity Inhibition Assay (In Vitro)
IC50
2615±115 nM
Citation
 Kozikowski, AShen, SBergman, JGaisina, I Tetrahydroquinoline substituted hydroxamic acids as selective histone deacetylase 6 inhibitors US Patent  US10456394 Publication Date 10/29/2019 
Target
Name:
Histone deacetylase 1
Synonyms:
Cereblon/Histone deacetylase 1 HDAC1 Histone deacetylase 1 (HDAC1) RPD3L1
Type:
Enzyme
Mol. Mass.:
55090.27
Organism:
Homo sapiens (Human)
Description:
Q13547
Residue:
482
  
Inhibitor
Name:
BDBM417068
Synonyms:
US10456394, Example 6
Type:
Small organic molecule
Emp. Form.:
C17H16Cl2N2O2
Mol. Mass.:
351.227
SMILES:
ONC(=O)c1ccc(CN2CCCc3cc(Cl)c(Cl)cc23)cc1
: