Target
Histone deacetylase 1
Ligand
BDBM417118
Substrate
Meas. Tech.
HDAC Enzyme Activity Inhibition Assay (In Vitro)
IC50
21100±800 nM
Citation
 Kozikowski, AShen, SBergman, JGaisina, I Tetrahydroquinoline substituted hydroxamic acids as selective histone deacetylase 6 inhibitors US Patent  US10456394 Publication Date 10/29/2019 
Target
Name:
Histone deacetylase 1
Synonyms:
Cereblon/Histone deacetylase 1 HDAC1 Histone deacetylase 1 (HDAC1) RPD3L1
Type:
Enzyme
Mol. Mass.:
55090.27
Organism:
Homo sapiens (Human)
Description:
Q13547
Residue:
482
  
Inhibitor
Name:
BDBM417118
Synonyms:
US10456394, Example 13
Type:
Small organic molecule
Emp. Form.:
C19H21FN2O2
Mol. Mass.:
328.3806
SMILES:
CC1(C)CCN(Cc2ccc(cc2)C(=O)NO)c2ccc(F)cc12
: