Target
Histone deacetylase 1
Ligand
BDBM417119
Substrate
Meas. Tech.
HDAC Enzyme Activity Inhibition Assay (In Vitro)
IC50
8750±1070 nM
Citation
 Kozikowski, AShen, SBergman, JGaisina, I Tetrahydroquinoline substituted hydroxamic acids as selective histone deacetylase 6 inhibitors US Patent  US10456394 Publication Date 10/29/2019 
Target
Name:
Histone deacetylase 1
Synonyms:
Cereblon/Histone deacetylase 1 HDAC1 Histone deacetylase 1 (HDAC1) RPD3L1
Type:
Enzyme
Mol. Mass.:
55090.27
Organism:
Homo sapiens (Human)
Description:
Q13547
Residue:
482
  
Inhibitor
Name:
BDBM417119
Synonyms:
US10456394, Example 14 | US10456394, Example 15
Type:
Small organic molecule
Emp. Form.:
C22H26N2O4
Mol. Mass.:
382.4528
SMILES:
COC(=O)c1ccc(CN2CCN(C(=O)OC(C)(C)C)c3ccccc23)cc1
: