Target
Tyrosine-protein kinase BTK
Ligand
BDBM259437
Substrate
Meas. Tech.
Inhibition of Btk Enzymatic Activity
IC50
17.0±n/a nM
Citation
 Angst, DGessier, FVulpetti, A Amino pyrimidine derivatives US Patent  US10457647 Publication Date 10/29/2019 
Target
Name:
Tyrosine-protein kinase BTK
Synonyms:
AGMX1 Agammaglobulinaemia tyrosine kinase B cell progenitor kinase BPK BTK_HUMAN Tyrosine Kinase BTK Tyrosine-protein kinase BTK (BTK)
Type:
Enzyme
Mol. Mass.:
76289.95
Organism:
Homo sapiens (Human)
Description:
Q06187
Residue:
659
  
Inhibitor
Name:
BDBM259437
Synonyms:
US10457647, Example 36 US11673868, Example 36 | US9512084, 36
Type:
Small organic molecule
Emp. Form.:
C28H27F2N5O3
Mol. Mass.:
519.5425
SMILES:
Cc1c(NC(=O)c2ccc(cc2F)C2CC2)cc(F)cc1-c1ncnc(N)c1OC[C@H]1CCN1C(=O)C=C
: