Target
Sodium channel protein type 9 subunit alpha
Ligand
BDBM417382
Substrate
Meas. Tech.
Electrophysiological Assay (EP) (In Vitro Assay)
IC50
1.17±n/a nM
Citation
 Sutherlin, DMcKerrall, SWilson, MSLai, KWBergeron, PZhang, BBeveridge, RLeclerc, JLemire, AZhao, LSturino, C Therapeutic compounds and methods of use thereof US Patent  US10457654 Publication Date 10/29/2019 
Target
Name:
Sodium channel protein type 9 subunit alpha
Synonyms:
NENA Peripheral sodium channel 1 SCN9A_HUMAN Voltage-gated sodium channel subunit Nav1.7 hNE-Na
Type:
Protein
Mol. Mass.:
226375.97
Organism:
Homo sapiens (Human)
Description:
Q15858
Residue:
1988
  
Inhibitor
Name:
BDBM417382
Synonyms:
US10457654, Example 238
Type:
Small organic molecule
Emp. Form.:
C25H25ClF4N4O3S
Mol. Mass.:
573.003
SMILES:
CN(C)[C@H]1C[C@H](CC[C@@H]1Oc1cc(F)c(cc1Cl)S(=O)(=O)Nc1ccncn1)c1cccc(c1)C(F)(F)F
: