Target
Mitogen-activated protein kinase 1
Ligand
BDBM417399
Substrate
Meas. Tech.
ERK2 In Vitro Inhibition Assay
IC50
1.90±n/a nM
Citation
 Berdini, VBuck, IMDay, JEGriffiths-Jones, CMHeightman, TDHoward, SMurray, CWNorton, DO Reilly, MWoolford, AJCooke, MLCousin, DOnions, STShannon, JMWatts, JP Benzolactam compounds as protein kinase inhibitors US Patent  US10457669 Publication Date 10/29/2019 
Target
Name:
Mitogen-activated protein kinase 1
Synonyms:
ERK2 Extracellular signal-regulated kinase 2 Extracellular signal-regulated kinase 2 (ERK2) MAPK 2 MK01_HUMAN Mitogen-activated protein kinase 1 (ERK-2) Mitogen-activated protein kinase 2 PRKM2 | p42-MAPK
Type:
Ser/Thr Protein Kinase
Mol. Mass.:
41392.76
Organism:
Homo sapiens (Human)
Description:
P28482
Residue:
360
  
Inhibitor
Name:
BDBM417399
Synonyms:
2-(6-{5-chloro-2- [(oxan-4-yl)amino] pyrimidin-4-yl)-1-oxo- 2,3-dihydro-1H- isoindol-2-yl)-N-(1,1,1- trifluoro-2- methylpropan-2- yl)acetamide US11001575, Example 11
Type:
Small organic molecule
Emp. Form.:
C23H25ClF3N5O3
Mol. Mass.:
511.925
SMILES:
CC(C)(NC(=O)CN1Cc2ccc(cc2C1=O)-c1nc(NC2CCOCC2)ncc1Cl)C(F)(F)F
: