Target
Mitogen-activated protein kinase 1
Ligand
BDBM417753
Substrate
Meas. Tech.
ERK2 In Vitro Inhibition Assay
IC50
1.70±n/a nM
Citation
 Berdini, VBuck, IMDay, JEGriffiths-Jones, CMHeightman, TDHoward, SMurray, CWNorton, DO Reilly, MWoolford, AJCooke, MLCousin, DOnions, STShannon, JMWatts, JP Benzolactam compounds as protein kinase inhibitors US Patent  US10457669 Publication Date 10/29/2019 
Target
Name:
Mitogen-activated protein kinase 1
Synonyms:
ERK2 Extracellular signal-regulated kinase 2 Extracellular signal-regulated kinase 2 (ERK2) MAPK 2 MK01_HUMAN Mitogen-activated protein kinase 1 (ERK-2) Mitogen-activated protein kinase 2 PRKM2 | p42-MAPK
Type:
Ser/Thr Protein Kinase
Mol. Mass.:
41392.76
Organism:
Homo sapiens (Human)
Description:
P28482
Residue:
360
  
Inhibitor
Name:
BDBM417753
Synonyms:
2-[6-(5-chloro-2-{[3- (hydroxymethyl) oxetan-3- yl]amino}pyrimidin- 4-yl)-1-oxo-2,3- dihydro-1H- isoindol-2-yl]-N- [(1R)-1-(3- methoxyphenyl) ethyl]acetamide US11001575, Example 383
Type:
Small organic molecule
Emp. Form.:
C27H28ClN5O5
Mol. Mass.:
537.995
SMILES:
COc1cccc(c1)[C@@H](C)NC(=O)CN1Cc2ccc(cc2C1=O)-c1nc(NC2(CO)COC2)ncc1Cl
: