Target
Histone deacetylase 9
Ligand
BDBM272128
Substrate
Meas. Tech.
Analysis of Inhibition of HDAC9 with the Compounds
IC50
210±n/a nM
Citation
 Dominguez, CMuñoz-Sanjuán, IBürli, RWLuckhurst, CAAllen, DRRaphy, GBreccia, PHaughan, AFWishart, GHughes, SJJarvis, REVater, HDPenrose, SDWall, MStott, AJSaville-Stones, EA Histone deacetylase inhibitors and compositions and methods of use thereof US Patent  US10457675 Publication Date 10/29/2019 
Target
Name:
Histone deacetylase 9
Synonyms:
HD9 HDAC7B HDAC9_HUMAN Histone acetylase 9 (HDAC9) Histone deacetylase 9 (HDAC9) Human HDAC9 MITR
Type:
Enzyme
Mol. Mass.:
111304.31
Organism:
Homo sapiens (Human)
Description:
Q9UKV0
Residue:
1011
  
Inhibitor
Name:
BDBM272128
Synonyms:
E1-(abs)-5-(3-Fluoro-2-methylphenyl)-2-(3- fluorophenyl)-N-hydroxy-5,6-dihydro-4H- cyclopenta[d]thiazole-5-carboxamide US10065948, 65 | US10457675, Example 65
Type:
Small organic molecule
Emp. Form.:
C20H16F2N2O2S
Mol. Mass.:
386.415
SMILES:
Cc1c(F)cccc1C1(Cc2nc(sc2C1)-c1cccc(F)c1)C(=O)NO
: