Target
Serine-protein kinase ATM
Ligand
BDBM418501
Substrate
Meas. Tech.
ATM kinase assay—determination of ATM inhibition (IC50 ATM)
IC50
<1.000±n/a nM
Citation
 Fuchss, TSchiemann, K Imidazolonylquinolines and the use thereof as ATM kinase inhibitors US Patent  US10457677 Publication Date 10/29/2019 
Target
Name:
Serine-protein kinase ATM
Synonyms:
A-T mutated ATM_HUMAN | Ataxia telangiectasia mutated
Type:
Protein
Mol. Mass.:
350696.72
Organism:
Homo sapiens (Human)
Description:
Q13315
Residue:
3056
  
Inhibitor
Name:
BDBM418501
Synonyms:
8-(3-Amino-1H-pyrazol-5- yl)-1-(3-fluoro-2-pyridyl)-7- methoxy-3-methyl-imidazo- [4,5-c]quinolin-2-one US10975075, Example 65 | US11608338, Example 65
Type:
Small organic molecule
Emp. Form.:
C20H16FN7O2
Mol. Mass.:
405.3851
SMILES:
COc1cc2ncc3n(C)c(=O)n(-c4ncccc4F)c3c2cc1-c1cc(N)n[nH]1
: