Target
Cannabinoid receptor 1
Ligand
BDBM295698
Substrate
Meas. Tech.
CB1 cAMP (Assay 2)
EC50
87000±n/a nM
Citation
 Riether, DBinder, FPDoods, HMueller, SGNicholson, JRSauer, A (Cyano-dimethyl-methyl)-isoxazoles and -[1,3,4]thiadiazoles US Patent  US10112934 Publication Date 10/30/2018 
Target
Name:
Cannabinoid receptor 1
Synonyms:
CANN6 CB-R CNR CNR1_HUMAN Cannabinoid receptor Cannabinoid receptor 1 (brain)
Type:
G Protein-Coupled Receptor (GPCR)
Mol. Mass.:
52868.96
Organism:
Homo sapiens (Human)
Description:
P21554
Residue:
472
  
Inhibitor
Name:
BDBM295698
Synonyms:
US10112934, Example 6 US11084810, Example 6 | US11725004, Example 6
Type:
Small organic molecule
Emp. Form.:
C17H24N4O3
Mol. Mass.:
332.3975
SMILES:
CC(C)(C#N)c1cc(NC(=O)[C@@H]2CCCN2C2CCOCC2)on1
: