Target
Mitogen-activated protein kinase kinase kinase 5
Ligand
BDBM418961
Substrate
Meas. Tech.
HTRF KinEASE Assay
IC50
55±n/a nM
Citation
 Granger, BWang, GShen, RHe, JHe, YXing, XMa, JLong, JWang, BOr, YS Apoptosis signal-regulating kinase 1 inhibitors and methods of use thereof US Patent  US10450301 Publication Date 10/22/2019 
Target
Name:
Mitogen-activated protein kinase kinase kinase 5
Synonyms:
ASK1 MAP3K5 MEKK5
Type:
Protein
Mol. Mass.:
154514.93
Organism:
Homo sapiens (Human)
Description:
Q99683
Residue:
1374
  
Inhibitor
Name:
BDBM418961
Synonyms:
US10450301, Example 40
Type:
Small organic molecule
Emp. Form.:
C22H23F4N7O3S
Mol. Mass.:
541.522
SMILES:
CC(C)n1nnnc1-c1cccc(NC(=O)c2cc3CN(CCc3cc2F)S(=O)(=O)CCC(F)(F)F)n1
: