Target
Mitogen-activated protein kinase kinase kinase 5
Ligand
BDBM418992
Substrate
Meas. Tech.
HTRF KinEASE Assay
IC50
>1000±n/a nM
Citation
 Granger, BWang, GShen, RHe, JHe, YXing, XMa, JLong, JWang, BOr, YS Apoptosis signal-regulating kinase 1 inhibitors and methods of use thereof US Patent  US10450301 Publication Date 10/22/2019 
Target
Name:
Mitogen-activated protein kinase kinase kinase 5
Synonyms:
ASK1 MAP3K5 MEKK5
Type:
Protein
Mol. Mass.:
154514.93
Organism:
Homo sapiens (Human)
Description:
Q99683
Residue:
1374
  
Inhibitor
Name:
BDBM418992
Synonyms:
US10450301, Example 71
Type:
Small organic molecule
Emp. Form.:
C19H20FN7O
Mol. Mass.:
381.4068
SMILES:
CC(C)c1nnnn1-c1cccc(NC(=O)c2cc3CNCCc3cc2F)n1
: