Target
Mitogen-activated protein kinase kinase kinase 5
Ligand
BDBM419092
Substrate
Meas. Tech.
HTRF KinEASE Assay
IC50
5.5±n/a nM
Citation
 Granger, BWang, GShen, RHe, JHe, YXing, XMa, JLong, JWang, BOr, YS Apoptosis signal-regulating kinase 1 inhibitors and methods of use thereof US Patent  US10450301 Publication Date 10/22/2019 
Target
Name:
Mitogen-activated protein kinase kinase kinase 5
Synonyms:
ASK1 MAP3K5 MEKK5
Type:
Protein
Mol. Mass.:
154514.93
Organism:
Homo sapiens (Human)
Description:
Q99683
Residue:
1374
  
Inhibitor
Name:
BDBM419092
Synonyms:
US10450301, Example 171
Type:
Small organic molecule
Emp. Form.:
C24H25N9O2
Mol. Mass.:
471.5144
SMILES:
C[C@H](CO)n1nnnc1-c1cccc(NC(=O)c2cc3CN(Cc4ccccn4)CCc3cn2)n1
: