Target
Fibroblast growth factor receptor 3
Ligand
BDBM278501
Substrate
Meas. Tech.
Enzymatic Assay
IC50
<100±n/a nM
Citation
 Lu, LYao, WHe, CZhang, F Bicyclic heterocycles as FGFR inhibitors US Patent  US10450313 Publication Date 10/22/2019 
Target
Name:
Fibroblast growth factor receptor 3
Synonyms:
CD_antigen: CD333 FGFR3 Fibroblast growth factor receptor JTK4
Type:
Protein
Mol. Mass.:
87699.57
Organism:
Homo sapiens (Human)
Description:
P22607
Residue:
806
  
Inhibitor
Name:
BDBM278501
Synonyms:
7-amino-3-(2,6-difluoro-3,5-dimethoxyphenyl)-1-methyl-8-pyridin-4-yl-3,4-dihydropyrido[4,3-d]pyrimidin-2(1H)-one US10450313, Example 17 US11530214, Example 17
Type:
Small organic molecule
Emp. Form.:
C21H19F2N5O3
Mol. Mass.:
427.4041
SMILES:
COc1cc(OC)c(F)c(N2Cc3cnc(N)c(-c4ccncc4)c3N(C)C2=O)c1F
: