Target
Fibroblast growth factor receptor 2
Ligand
BDBM278504
Substrate
Meas. Tech.
Enzymatic Assay
IC50
<100±n/a nM
Citation
 Lu, LYao, WHe, CZhang, F Bicyclic heterocycles as FGFR inhibitors US Patent  US10450313 Publication Date 10/22/2019 
Target
Name:
Fibroblast growth factor receptor 2
Synonyms:
BEK FGFR-2 FGFR2 Fibroblast growth factor receptor 2 (FGFR2) KGFR Keratinocyte growth factor receptor VEGF-receptor 2 and Fibroblast growth factor receptor 2
Type:
Enzyme
Mol. Mass.:
92015.45
Organism:
Homo sapiens (Human)
Description:
P21802
Residue:
821
  
Inhibitor
Name:
BDBM278504
Synonyms:
7-amino-8-benzyl-3-(2,6-difluoro-3,5-dimethoxyphenyl)-1-methyl-3,4-dihydropyrido[4,3-d]pyrimidin-2(1H)-one US10450313, Example 20 US11530214, Example 20
Type:
Small organic molecule
Emp. Form.:
C23H22F2N4O3
Mol. Mass.:
440.4426
SMILES:
COc1cc(OC)c(F)c(N2Cc3cnc(N)c(Cc4ccccc4)c3N(C)C2=O)c1F
: