Target
Fibroblast growth factor receptor 2
Ligand
BDBM278509
Substrate
Meas. Tech.
Enzymatic Assay
IC50
<100±n/a nM
Citation
 Lu, LYao, WHe, CZhang, F Bicyclic heterocycles as FGFR inhibitors US Patent  US10450313 Publication Date 10/22/2019 
Target
Name:
Fibroblast growth factor receptor 2
Synonyms:
BEK FGFR-2 FGFR2 Fibroblast growth factor receptor 2 (FGFR2) KGFR Keratinocyte growth factor receptor VEGF-receptor 2 and Fibroblast growth factor receptor 2
Type:
Enzyme
Mol. Mass.:
92015.45
Organism:
Homo sapiens (Human)
Description:
P21802
Residue:
821
  
Inhibitor
Name:
BDBM278509
Synonyms:
2'-(2,6-difluoro-3,5-dimethoxyphenyl)-6'-(methylamino)-1',2'-dihydro-3'H-spiro[cyclopropane-1,4'-[2,7]naphthyridin]-3'-one US10450313, Example 25 US11530214, Example 25
Type:
Small organic molecule
Emp. Form.:
C19H19F2N3O3
Mol. Mass.:
375.3693
SMILES:
CNc1cc2c(CN(C(=O)C22CC2)c2c(F)c(OC)cc(OC)c2F)cn1
: