Target
Fibroblast growth factor receptor 2
Ligand
BDBM419149
Substrate
Meas. Tech.
Enzymatic Assay
IC50
<100±n/a nM
Citation
 Lu, LYao, WHe, CZhang, F Bicyclic heterocycles as FGFR inhibitors US Patent  US10450313 Publication Date 10/22/2019 
Target
Name:
Fibroblast growth factor receptor 2
Synonyms:
BEK FGFR-2 FGFR2 Fibroblast growth factor receptor 2 (FGFR2) KGFR Keratinocyte growth factor receptor VEGF-receptor 2 and Fibroblast growth factor receptor 2
Type:
Enzyme
Mol. Mass.:
92015.45
Organism:
Homo sapiens (Human)
Description:
P21802
Residue:
821
  
Inhibitor
Name:
BDBM419149
Synonyms:
2′-(2,6-difluoro-3,5-dimethoxyphenyl)-6′-((1-methyl-1H-pyrazol-4-yl)methylamino)-1′H-spiro[cyclopropane-1,4′-[2,7]naphthyridin]-3′(2′H)-one | US10450313, Example 37
Type:
Small organic molecule
Emp. Form.:
C24H24F2N4O3
Mol. Mass.:
454.4692
SMILES:
COc1cc(OC)c(F)c(N2Cc3cnc(NCc4ccn(C)c4)cc3C3(CC3)C2=O)c1F
: