Target
Fibroblast growth factor receptor 1
Ligand
BDBM278525
Substrate
Meas. Tech.
Enzymatic Assay
IC50
<100±n/a nM
Citation
 Lu, LYao, WHe, CZhang, F Bicyclic heterocycles as FGFR inhibitors US Patent  US10450313 Publication Date 10/22/2019 
Target
Name:
Fibroblast growth factor receptor 1
Synonyms:
BFGFR Basic fibroblast growth factor receptor 1 (FGFR1) CEK FGFR-1 FGFR-1, (FL) FGFR1_HUMAN FLT2 Fibroblast growth factor receptor 1 (FGFR-1) Fms-like tyrosine kinase 2 N-sam bFGF-R | c-fgr
Type:
Receptor
Mol. Mass.:
91861.70
Organism:
Homo sapiens (Human)
Description:
P11362
Residue:
822
  
Inhibitor
Name:
BDBM278525
Synonyms:
6'-(cyclopropylamino)-2'-(2,6-difluoro-3,5-dimethoxyphenyl)-1'H-spiro[cyclopropane-1,4'-[2,7]naphthyridin]-3'(2'H)-one US10450313, Example 41 US11530214, Example 41
Type:
Small organic molecule
Emp. Form.:
C21H21F2N3O3
Mol. Mass.:
401.4065
SMILES:
COc1cc(OC)c(F)c(N2Cc3cnc(NC4CC4)cc3C3(CC3)C2=O)c1F
: