Target
Fibroblast growth factor receptor 3
Ligand
BDBM278526
Substrate
Meas. Tech.
Enzymatic Assay
IC50
<100±n/a nM
Citation
 Lu, LYao, WHe, CZhang, F Bicyclic heterocycles as FGFR inhibitors US Patent  US10450313 Publication Date 10/22/2019 
Target
Name:
Fibroblast growth factor receptor 3
Synonyms:
CD_antigen: CD333 FGFR3 Fibroblast growth factor receptor JTK4
Type:
Protein
Mol. Mass.:
87699.57
Organism:
Homo sapiens (Human)
Description:
P22607
Residue:
806
  
Inhibitor
Name:
BDBM278526
Synonyms:
6'-(cyclobutylamino)-2'-(2,6-difluoro-3,5-dimethoxyphenyl)-1'H-spiro[cyclopropane-1,4'-[2,7]naphthyridin]-3'(2'H)-one US10450313, Example 42 US11530214, Example 42
Type:
Small organic molecule
Emp. Form.:
C22H23F2N3O3
Mol. Mass.:
415.4331
SMILES:
COc1cc(OC)c(F)c(N2Cc3cnc(NC4CCC4)cc3C3(CC3)C2=O)c1F
: