Target
Fibroblast growth factor receptor 2
Ligand
BDBM278528
Substrate
Meas. Tech.
Enzymatic Assay
IC50
<100±n/a nM
Citation
 Lu, LYao, WHe, CZhang, F Bicyclic heterocycles as FGFR inhibitors US Patent  US10450313 Publication Date 10/22/2019 
Target
Name:
Fibroblast growth factor receptor 2
Synonyms:
BEK FGFR-2 FGFR2 Fibroblast growth factor receptor 2 (FGFR2) KGFR Keratinocyte growth factor receptor VEGF-receptor 2 and Fibroblast growth factor receptor 2
Type:
Enzyme
Mol. Mass.:
92015.45
Organism:
Homo sapiens (Human)
Description:
P21802
Residue:
821
  
Inhibitor
Name:
BDBM278528
Synonyms:
2'-(2,6-difluoro-3,5-dimethoxyphenyl)-6'-(1-methylpiperidin-4-ylamino)-1'H-spiro[cyclopropane-1,4'-[2,7]naphthyridin]-3'(2'H)-one US10450313, Example 44 US11530214, Example 44
Type:
Small organic molecule
Emp. Form.:
C24H28F2N4O3
Mol. Mass.:
458.5009
SMILES:
COc1cc(OC)c(F)c(N2Cc3cnc(NC4CCN(C)CC4)cc3C3(CC3)C2=O)c1F
: