Target
Fibroblast growth factor receptor 1
Ligand
BDBM278531
Substrate
Meas. Tech.
Enzymatic Assay
IC50
<100±n/a nM
Citation
 Lu, LYao, WHe, CZhang, F Bicyclic heterocycles as FGFR inhibitors US Patent  US10450313 Publication Date 10/22/2019 
Target
Name:
Fibroblast growth factor receptor 1
Synonyms:
BFGFR Basic fibroblast growth factor receptor 1 (FGFR1) CEK FGFR-1 FGFR-1, (FL) FGFR1_HUMAN FLT2 Fibroblast growth factor receptor 1 (FGFR-1) Fms-like tyrosine kinase 2 N-sam bFGF-R | c-fgr
Type:
Receptor
Mol. Mass.:
91861.70
Organism:
Homo sapiens (Human)
Description:
P11362
Residue:
822
  
Inhibitor
Name:
BDBM278531
Synonyms:
7-amino-3-(2,6-difluoro-3,5-dimethoxyphenyl)-8-methyl-1-[(1-methyl-1H-pyrazol-4-yl)methyl]-3,4-dihydropyrido[4,3-d]pyrimidin-2(1H)-one US10450313, Example 47 US11530214, Example 47
Type:
Small organic molecule
Emp. Form.:
C21H22F2N6O3
Mol. Mass.:
444.4346
SMILES:
COc1cc(OC)c(F)c(N2Cc3cnc(N)c(C)c3N(Cc3cnn(C)c3)C2=O)c1F
: