Target
Fibroblast growth factor receptor 1
Ligand
BDBM278532
Substrate
Meas. Tech.
Enzymatic Assay
IC50
<100±n/a nM
Citation
 Lu, LYao, WHe, CZhang, F Bicyclic heterocycles as FGFR inhibitors US Patent  US10450313 Publication Date 10/22/2019 
Target
Name:
Fibroblast growth factor receptor 1
Synonyms:
BFGFR Basic fibroblast growth factor receptor 1 (FGFR1) CEK FGFR-1 FGFR-1, (FL) FGFR1_HUMAN FLT2 Fibroblast growth factor receptor 1 (FGFR-1) Fms-like tyrosine kinase 2 N-sam bFGF-R | c-fgr
Type:
Receptor
Mol. Mass.:
91861.70
Organism:
Homo sapiens (Human)
Description:
P11362
Residue:
822
  
Inhibitor
Name:
BDBM278532
Synonyms:
US10040790, Example 48 US10947230, Example 48 methyl [3-(2,6-difluoro-3,5-dimethoxyphenyl)-1,8-dimethyl-2-oxo-1,2,3,4-tetrahydropyrido [4,3-d]pyrimidin-7-yl]carbamate
Type:
Small organic molecule
Emp. Form.:
C19H20F2N4O5
Mol. Mass.:
422.3827
SMILES:
COC(=O)Nc1ncc2CN(C(=O)N(C)c2c1C)c1c(F)c(OC)cc(OC)c1F
: