Target
Nuclear receptor ROR-gamma
Ligand
BDBM50461065
Substrate
Meas. Tech.
GAL4-RORgamma Transactivation
IC50
<100±n/a nM
Citation
 Musicki, BBouix-Peter, COuvry, GThoreau, E Benzenesulfonamide derivatives as inverse agonists of retinoid-related orphan receptor gamma (RORγ(T)) US Patent  US10457637 Publication Date 10/29/2019 
Target
Name:
Nuclear receptor ROR-gamma
Synonyms:
NR1F3 Nuclear receptor ROR-gamma (RORC) RAR-related orphan receptor C (RORc) RORG RZRG Retinoid-related orphan receptor-gamma (RORc)
Type:
Enzyme Catalytic Domain
Mol. Mass.:
58218.40
Organism:
Homo sapiens (Human)
Description:
P51449
Residue:
518
  
Inhibitor
Name:
BDBM50461065
Synonyms:
CHEMBL4225020 | US10457637, Compound 18
Type:
Small organic molecule
Emp. Form.:
C26H38N2O5S2
Mol. Mass.:
522.72
SMILES:
CCc1ccc(cc1)N(CC(C)C)S(=O)(=O)c1ccc(OCC2CCOCC2)c(c1)S(=N)(=O)CC
: