Target
Nuclear receptor ROR-gamma
Ligand
BDBM419237
Substrate
Meas. Tech.
GAL4-RORgamma Transactivation
IC50
550±n/a nM
Citation
 Musicki, BBouix-Peter, COuvry, GThoreau, E Benzenesulfonamide derivatives as inverse agonists of retinoid-related orphan receptor gamma (RORγ(T)) US Patent  US10457637 Publication Date 10/29/2019 
Target
Name:
Nuclear receptor ROR-gamma
Synonyms:
NR1F3 Nuclear receptor ROR-gamma (RORC) RAR-related orphan receptor C (RORc) RORG RZRG Retinoid-related orphan receptor-gamma (RORc)
Type:
Enzyme Catalytic Domain
Mol. Mass.:
58218.40
Organism:
Homo sapiens (Human)
Description:
P51449
Residue:
518
  
Inhibitor
Name:
BDBM419237
Synonyms:
4-((1R,4R)-2-oxa-5- azabicyclo[2.2.1]heptan-5- yl)-N-(4-ethylphenyl)-N- isobutyl-3-(S- methylsulfonimidoyl) benzenesulfonamide | US10457637, Compound 115
Type:
Small organic molecule
Emp. Form.:
C24H33N3O4S2
Mol. Mass.:
491.667
SMILES:
CCc1ccc(cc1)N(CC(C)C)S(=O)(=O)c1ccc(N2C[C@H]3C[C@@H]2CO3)c(c1)S(C)(=N)=O
: