Target
Interleukin-17A
Ligand
BDBM419250
Substrate
Meas. Tech.
I L-17A Secretion
IC50
>1000±n/a nM
Citation
 Musicki, BBouix-Peter, COuvry, GThoreau, E Benzenesulfonamide derivatives as inverse agonists of retinoid-related orphan receptor gamma (RORγ(T)) US Patent  US10457637 Publication Date 10/29/2019 
Target
Name:
Interleukin-17A
Synonyms:
CTLA8 IL-17 IL17A il-17a
Type:
Enzyme Catalytic Domain
Mol. Mass.:
17511.44
Organism:
Homo sapiens (Human)
Description:
Q16552
Residue:
155
  
Inhibitor
Name:
BDBM419250
Synonyms:
N-(4-ethylphenyl)-4-(3- hydroxyazetidin-1-yl)-N- isobutyl-3-(S- methylsulfonimidoyl) benzenesulfonamide | US10457637, Compound 131
Type:
Small organic molecule
Emp. Form.:
C22H31N3O4S2
Mol. Mass.:
465.629
SMILES:
CCc1ccc(cc1)N(CC(C)C)S(=O)(=O)c1ccc(N2CC(O)C2)c(c1)S(C)(=N)=O
: