Target
Nuclear receptor ROR-gamma
Ligand
BDBM419251
Substrate
Meas. Tech.
GAL4-RORgamma Transactivation
IC50
>1000±n/a nM
Citation
 Musicki, BBouix-Peter, COuvry, GThoreau, E Benzenesulfonamide derivatives as inverse agonists of retinoid-related orphan receptor gamma (RORγ(T)) US Patent  US10457637 Publication Date 10/29/2019 
Target
Name:
Nuclear receptor ROR-gamma
Synonyms:
NR1F3 Nuclear receptor ROR-gamma (RORC) RAR-related orphan receptor C (RORc) RORG RZRG Retinoid-related orphan receptor-gamma (RORc)
Type:
Enzyme Catalytic Domain
Mol. Mass.:
58218.40
Organism:
Homo sapiens (Human)
Description:
P51449
Residue:
518
  
Inhibitor
Name:
BDBM419251
Synonyms:
N-(4-ethylphenyl)-N- isobutyl-3-(S- methylsulfonimidoyl)-4- (((3-(pyrrolidin-1- yl)oxetan-3- yl)methyl)amino)benzene- sulfonamide | US10457637, Compound 132
Type:
Small organic molecule
Emp. Form.:
C27H40N4O4S2
Mol. Mass.:
548.761
SMILES:
CCc1ccc(cc1)N(CC(C)C)S(=O)(=O)c1ccc(NCC2(COC2)N2CCCC2)c(c1)S(C)(=N)=O
: