Target
Toll-like receptor 7
Ligand
BDBM419193
Substrate
Meas. Tech.
TLR7 Agonist Activity Assay
EC50
50.0±n/a nM
Citation
 Young, ISGangwar, SPosy, SLPoudel, YBSivaprakasam, P Toll-like receptor 7 (TLR7) agonists having a tricyclic moiety, conjugates thereof, and methods and uses therefor US Patent  US10457681 Publication Date 10/29/2019 
Target
Name:
Toll-like receptor 7
Synonyms:
ORF Names:UNQ248/PRO285 TLR7_HUMAN | Toll-like receptor 7 (TLR7)
Type:
Enzyme
Mol. Mass.:
120945.35
Organism:
Homo sapiens (Human)
Description:
Q9NYK1
Residue:
1049
  
Inhibitor
Name:
BDBM419193
Synonyms:
US10457681, Compound Ia-01 US10981914, Compound Ia-01
Type:
Small organic molecule
Emp. Form.:
C24H26N6O3S
Mol. Mass.:
478.567
SMILES:
CCCCOc1nc(N)c2nc(O)n(Cc3ccc4N(C)c5ccc(CO)cc5Sc4c3)c2n1
: