Target
Cannabinoid receptor 2
Ligand
BDBM419263
Substrate
Meas. Tech.
Radioligand Binding Assay
Ki
45.5±n/a nM
Citation
 Gobbi, LGrether, UGuba, WKretz, JMartin, REWestphal, MV [1,2,3]triazolo[4,5-d]pyrimidine derivatives US Patent  US10457684 Publication Date 10/29/2019 
Target
Name:
Cannabinoid receptor 2
Synonyms:
CANNABINOID CB2 CB2 CB2B CNR2_HUMAN Cannabinoid CB2 receptor Cannabinoid receptor 2 (CB2R) | hCB2
Type:
G Protein-Coupled Receptor (GPCR)
Mol. Mass.:
39690.94
Organism:
Homo sapiens (Human)
Description:
P34972
Residue:
360
  
Inhibitor
Name:
BDBM419263
Synonyms:
5-[Difluoro(phenyl)methyl]-3-[(4-methyl-1,2,5-oxadiazol-3-yl)methyl]-7-(1,2,5-triazaspiro[2.4]hept-1-en-5-yl)-3H-[1,2,3]triazolo[4,5-d]pyrimidine | US10457684, Example 7
Type:
Small organic molecule
Emp. Form.:
C19H16F2N10O
Mol. Mass.:
438.3935
SMILES:
Cc1nonc1Cn1nnc2c(nc(nc12)C(F)(F)c1ccccc1)N1CCC2(C1)N=N2
: