Target
Cannabinoid receptor 1
Ligand
BDBM419269
Substrate
Ki
147±n/a nM
Citation
 Gobbi, LGrether, UGuba, WKretz, JMartin, REWestphal, MV [1,2,3]triazolo[4,5-d]pyrimidine derivatives US Patent  US10457684 Publication Date 10/29/2019 
Target
Name:
Cannabinoid receptor 1
Synonyms:
CANN6 CB-R CNR CNR1_HUMAN Cannabinoid receptor Cannabinoid receptor 1 (brain)
Type:
G Protein-Coupled Receptor (GPCR)
Mol. Mass.:
52868.96
Organism:
Homo sapiens (Human)
Description:
P21554
Residue:
472
  
Inhibitor
Name:
BDBM419269
Synonyms:
5-tert-Butyl-7-(3,3-difluoropyrrolidin-1-yl)-3-[[2-ethynyl-6-[3-(trifluoromethyl)diazirin-3-yl]phenyl]methyl]triazolo[4,5-d]pyrimidine | US10457684, Example 13
Type:
Small organic molecule
Emp. Form.:
C23H21F5N8
Mol. Mass.:
504.4585
SMILES:
CC(C)(C)c1nc(N2CCC(F)(F)C2)c2nnn(Cc3c(cccc3C3(N=N3)C(F)(F)F)C#C)c2n1
: