Target
Rho-associated protein kinase 2
Ligand
BDBM295872
Substrate
Meas. Tech.
Biological Assays for Inhibition of Rho-Associated Protein Kinase
Temperature
298.15±n/a K
IC50
<1000±n/a nM
Comments
extracted
Citation
 Aicher, TDPadilla, FToogood, PLChen, S Indazolyl thiadiazolamines and related compounds for inhibition of Rho-associated protein kinase and the treatment of disease US Patent  US10112935 Publication Date 10/30/2018 
Target
Name:
Rho-associated protein kinase 2
Synonyms:
KIAA0619 ROCK2 Rho kinase 2 (ROCKII) Rho-associated protein kinase 2 (ROCK2) Rho-associated protein kinase 2/Transforming protein RhoA Rho-associated, coiled-coil-containing protein kinase II p164 ROCK-2
Type:
Protein
Mol. Mass.:
160885.43
Organism:
Homo sapiens (Human)
Description:
O75116
Residue:
1388
  
Inhibitor
Name:
BDBM295872
Synonyms:
N-(4-Chloro-1H-indazol-5-yl)-5-(3-(1-(2-methoxyethyl)-1H-imidazol-2-yl)phenyl)-1,3,4-thiadiazol-2-amine 2,2,2-trifluoroacetic Acid | US10112935, Example 44
Type:
Small organic molecule
Emp. Form.:
C21H18ClN7OS
Mol. Mass.:
451.932
SMILES:
COCCn1ccnc1-c1cccc(c1)-c1nnc(Nc2ccc3[nH]ncc3c2Cl)s1
: