Target
Rho-associated protein kinase 2
Ligand
BDBM295920
Substrate
Meas. Tech.
Biological Assays for Inhibition of Rho-Associated Protein Kinase
Temperature
298.15±n/a K
IC50
<1000±n/a nM
Comments
extracted
Citation
 Aicher, TDPadilla, FToogood, PLChen, S Indazolyl thiadiazolamines and related compounds for inhibition of Rho-associated protein kinase and the treatment of disease US Patent  US10112935 Publication Date 10/30/2018 
Target
Name:
Rho-associated protein kinase 2
Synonyms:
KIAA0619 ROCK2 Rho kinase 2 (ROCKII) Rho-associated protein kinase 2 (ROCK2) Rho-associated protein kinase 2/Transforming protein RhoA Rho-associated, coiled-coil-containing protein kinase II p164 ROCK-2
Type:
Protein
Mol. Mass.:
160885.43
Organism:
Homo sapiens (Human)
Description:
O75116
Residue:
1388
  
Inhibitor
Name:
BDBM295920
Synonyms:
US10112935, Compound 48AE
Type:
Small organic molecule
Emp. Form.:
C18H14N6O3S
Mol. Mass.:
394.407
SMILES:
CC(=O)Nc1cc(OC=O)cc(c1)-c1nnc(Nc2ccc3[nH]ncc3c2)s1
: