Target
Cannabinoid receptor 2
Ligand
BDBM419273
Substrate
Meas. Tech.
Radioligand Binding Assay
Ki
11.0±n/a nM
Citation
 Gobbi, LGrether, UGuba, WKretz, JMartin, REWestphal, MVIjzerman, AP [1,2,3]triazolo[4,5-D]pyrimidine derivatives with affinity for the type-2 cannabinoid receptor US Patent  US10457685 Publication Date 10/29/2019 
Target
Name:
Cannabinoid receptor 2
Synonyms:
CANNABINOID CB2 CB2 CB2B CNR2_HUMAN Cannabinoid CB2 receptor Cannabinoid receptor 2 (CB2R) | hCB2
Type:
G Protein-Coupled Receptor (GPCR)
Mol. Mass.:
39690.94
Organism:
Homo sapiens (Human)
Description:
P34972
Residue:
360
  
Inhibitor
Name:
BDBM419273
Synonyms:
(2-{[5-tert-Butyl-7-(3,3-difluoropyrrolidin-1-yl)-3H-[1,2,3]triazolo[4,5-d]pyrimidin-3-yl]methyl}phenyl)methanesulfonyl fluoride | US10457685, Example 2
Type:
Small organic molecule
Emp. Form.:
C20H23F3N6O2S
Mol. Mass.:
468.496
SMILES:
CC(C)(C)c1nc(N2CCC(F)(F)C2)c2nnn(Cc3ccccc3CS(F)(=O)=O)c2n1
: