Target
Cannabinoid receptor 1
Ligand
BDBM419284
Substrate
Meas. Tech.
Radioligand Binding Assay
Ki
>10000±n/a nM
Citation
 Gobbi, LGrether, UGuba, WKretz, JMartin, REWestphal, MVIjzerman, AP [1,2,3]triazolo[4,5-D]pyrimidine derivatives with affinity for the type-2 cannabinoid receptor US Patent  US10457685 Publication Date 10/29/2019 
Target
Name:
Cannabinoid receptor 1
Synonyms:
CANN6 CB-R CNR CNR1_HUMAN Cannabinoid receptor Cannabinoid receptor 1 (brain)
Type:
G Protein-Coupled Receptor (GPCR)
Mol. Mass.:
52868.96
Organism:
Homo sapiens (Human)
Description:
P21554
Residue:
472
  
Inhibitor
Name:
BDBM419284
Synonyms:
(3R)-1-{5-tert-Butyl-3-[(2-chlorophenyl)methyl]-3H-[1,2,3]triazolo[4,5-d]pyrimidin-7-yl}pyrrolidine-3-thiol or enantiomer | US10457685, Example 13
Type:
Small organic molecule
Emp. Form.:
C19H23ClN6S
Mol. Mass.:
402.944
SMILES:
CC(C)(C)c1nc(N2CC[C@@H](S)C2)c2nnn(Cc3ccccc3Cl)c2n1
: