Target
D-amino-acid oxidase
Ligand
BDBM210811
Substrate
Meas. Tech.
In Vitro DAAO Enzyme Assay
IC50
23.0±n/a nM
Citation
 Farnaby, WFieldhouse, CHazel, KKerr, CKinsella, NLivermore, DMerchant, KMiller, D Pyridazinone compounds and their use as DAAO inhibitors US Patent  US10463663 Publication Date 11/5/2019 
Target
Name:
D-amino-acid oxidase
Synonyms:
D-amino-acid oxidase (DAAO) DAMOX OXDA_HUMAN
Type:
Homodimer
Mol. Mass.:
39476.06
Organism:
Homo sapiens (Human)
Description:
P14920
Residue:
347
  
Inhibitor
Name:
BDBM210811
Synonyms:
US10463663, Example 49 US9290456, 49 | US9931340, Example 49
Type:
Small organic molecule
Emp. Form.:
C12H9F3N2O2
Mol. Mass.:
270.2073
SMILES:
Oc1cc(Cc2cccc(c2)C(F)(F)F)n[nH]c1=O
: