Target
Histone deacetylase 1
Ligand
BDBM419570
Substrate
Meas. Tech.
Enzyme Activity Inhibition Assay
IC50
71.0±n/a nM
Citation
 Lee, JHan, YKim, YMin, JBae, MKim, DJin, SKyung, J 1,3,4-oxadiazole sulfamide derivative compounds as histone deacetylase 6 inhibitor, and the pharmaceutical composition comprising the same US Patent  US10464911 Publication Date 11/5/2019 
Target
Name:
Histone deacetylase 1
Synonyms:
Cereblon/Histone deacetylase 1 HDAC1 Histone deacetylase 1 (HDAC1) RPD3L1
Type:
Enzyme
Mol. Mass.:
55090.27
Organism:
Homo sapiens (Human)
Description:
Q13547
Residue:
482
  
Inhibitor
Name:
BDBM419570
Synonyms:
US10464911, Example 4
Type:
Small organic molecule
Emp. Form.:
C22H21F4N5O4S
Mol. Mass.:
527.492
SMILES:
CC(=O)N1CCN(CC1)S(=O)(=O)N(Cc1ccc(cc1F)-c1nnc(o1)C(F)(F)F)c1ccccc1
: