Target
Histone deacetylase 1
Ligand
BDBM419607
Substrate
Meas. Tech.
Enzyme Activity Inhibition Assay
IC50
20.0±n/a nM
Citation
 Lee, JHan, YKim, YMin, JBae, MKim, DJin, SKyung, J 1,3,4-oxadiazole sulfamide derivative compounds as histone deacetylase 6 inhibitor, and the pharmaceutical composition comprising the same US Patent  US10464911 Publication Date 11/5/2019 
Target
Name:
Histone deacetylase 1
Synonyms:
Cereblon/Histone deacetylase 1 HDAC1 Histone deacetylase 1 (HDAC1) RPD3L1
Type:
Enzyme
Mol. Mass.:
55090.27
Organism:
Homo sapiens (Human)
Description:
Q13547
Residue:
482
  
Inhibitor
Name:
BDBM419607
Synonyms:
US10464911, Example 35
Type:
Small organic molecule
Emp. Form.:
C19H19F2N5O5S2
Mol. Mass.:
499.511
SMILES:
FC(F)c1nnc(o1)-c1ccc(CN(c2ccccc2)S(=O)(=O)N2CCS(=O)(=O)CC2)nc1
: