Target
Histone deacetylase 1
Ligand
BDBM419617
Substrate
Meas. Tech.
Enzyme Activity Inhibition Assay
IC50
130±n/a nM
Citation
 Lee, JHan, YKim, YMin, JBae, MKim, DJin, SKyung, J 1,3,4-oxadiazole sulfamide derivative compounds as histone deacetylase 6 inhibitor, and the pharmaceutical composition comprising the same US Patent  US10464911 Publication Date 11/5/2019 
Target
Name:
Histone deacetylase 1
Synonyms:
Cereblon/Histone deacetylase 1 HDAC1 Histone deacetylase 1 (HDAC1) RPD3L1
Type:
Enzyme
Mol. Mass.:
55090.27
Organism:
Homo sapiens (Human)
Description:
Q13547
Residue:
482
  
Inhibitor
Name:
BDBM419617
Synonyms:
US10464911, Example 45
Type:
Small organic molecule
Emp. Form.:
C24H25F4N5O4S
Mol. Mass.:
555.545
SMILES:
C[C@H]1CN(C[C@@H](C)N1C(=O)C(F)F)S(=O)(=O)N(Cc1ccc(cc1)-c1nnc(o1)C(F)F)c1ccccc1
: